Opened 9 years ago

Closed 9 years ago

Last modified 9 years ago

#1300 closed defect (invalid)

3972 with webif compile error

Reported by: boubaris Owned by:
Priority: blocker Component: General
Severity: high Keywords:
Cc: Sensitive: no

Description

Revision

3972

Issue Description

cannot compile with WEBIF enabled

When the issue occurs

always

How the issue is reproducable

<Please fill in>

[ 28%] Building C object CMakeFiles/csoscam.dir/oscam-ac.o
[ 29%] Building C object CMakeFiles/csoscam.dir/oscam-http.o
/root/OSCAM/oscam-svn/oscam-http.c: In function ‘send_oscam_reader_stats’:
/root/OSCAM/oscam-svn/oscam-http.c:1224: error: ‘stat_busy’ undeclared (first use in this function)
/root/OSCAM/oscam-svn/oscam-http.c:1224: error: (Each undeclared identifier is reported only once
/root/OSCAM/oscam-svn/oscam-http.c:1224: error: for each function it appears in.)
make[2]: *** [CMakeFiles/csoscam.dir/oscam-http.o] Error 1
make[1]: *** [CMakeFiles/csoscam.dir/all] Error 2
make: *** [all] Error 2

Change History (2)

comment:1 Changed 9 years ago by boubaris

Resolution: invalid
Status: newclosed

Something strange happened in my SDK
Now solved.

Sorry for inconvenience and for this dummy ticket.

comment:2 Changed 9 years ago by boubaris

Last edited 9 years ago by boubaris (previous) (diff)
Note: See TracTickets for help on using tickets.